Target
Runt-related transcription factor 1
Ligand
BDBM29629
Substrate
Venus-CBFbeta-SMMHC
Meas. Tech.
uHTS identification of compounds inhibiting the binding between the RUNX1 Runt domain and CBFb-SMMHC via a fluorescence resonance energy transfer (FRET) assay.
pH
7.4±n/a
Temperature
296.15±n/a K
IC50
100000±n/a nM
Citation
 PubChem, PC uHTS identification of compounds inhibiting the binding between the RUNX1 Runt domain and CBFbeta-SMMHC via a fluorescence resonance energy transfer (FRET) assay. PubChem Bioassay (2009)[AID] 
Target
Name:
Runt-related transcription factor 1
Synonyms:
AML1 CBF-alpha-2 Core-binding factor subunit alpha-2 Polyomavirus enhancer-binding protein 2 alpha B subunit RUNX1_HUMAN | Runt-Related Transcription Factor 1 Isoform AML1C
Type:
Subunit of heterodimeric transcription factor
Mol. Mass.:
48750.25
Organism:
Homo sapiens (Human)
Description:
Q01196
Residue:
453
  
Inhibitor
Name:
BDBM29629
Synonyms:
1-(2-furanylmethyl)-3-(3-methylphenyl)sulfonyl-2-pyrrolo[3,2-b]quinoxalinamine 1-(furan-2-ylmethyl)-3-(3-methylphenyl)sulfonylpyrrolo[3,2-b]quinoxalin-2-amine SMR000048006 cid_666651
Type:
Small organic molecule
Emp. Form.:
C22H18N4O3S
Mol. Mass.:
418.468
SMILES:
Cc1cccc(c1)S(=O)(=O)c1c(N)n(Cc2ccco2)c2nc3ccccc3nc12
:
Substrate
Name:
Core-binding factor subunit beta isoform 2
Synonyms:
CBFB PEBB_HUMAN Venus-core-binding factor subunit beta-smooth muscle myosin heavy chain
Type:
Fluorescent fusion protein
Mol. Mass.:
21988.19
Organism:
Homo sapiens (Human)
Description:
Q13951-2
Residue:
187