Target
Runt-related transcription factor 1
Ligand
BDBM29659
Substrate
Venus-CBFbeta-SMMHC
Meas. Tech.
uHTS identification of compounds inhibiting the binding between the RUNX1 Runt domain and CBFb-SMMHC via a fluorescence resonance energy transfer (FRET) assay.
pH
7.4±n/a
Temperature
296.15±n/a K
IC50
86300±n/a nM
Citation
 PubChem, PC uHTS identification of compounds inhibiting the binding between the RUNX1 Runt domain and CBFbeta-SMMHC via a fluorescence resonance energy transfer (FRET) assay. PubChem Bioassay (2009)[AID] 
Target
Name:
Runt-related transcription factor 1
Synonyms:
AML1 CBF-alpha-2 Core-binding factor subunit alpha-2 Polyomavirus enhancer-binding protein 2 alpha B subunit RUNX1_HUMAN | Runt-Related Transcription Factor 1 Isoform AML1C
Type:
Subunit of heterodimeric transcription factor
Mol. Mass.:
48750.25
Organism:
Homo sapiens (Human)
Description:
Q01196
Residue:
453
  
Inhibitor
Name:
BDBM29659
Synonyms:
2-Amino-1-[2-(2-fluoro-phenyl)-ethyl]-1H-pyrrolo[2,3-b]quinoxaline-3-carboxylic acid (furan-2-ylmethyl)-amide 2-amino-1-[2-(2-fluorophenyl)ethyl]-N-(2-furfuryl)pyrrolo[3,2-b]quinoxaline-3-carboxamide 2-azanyl-1-[2-(2-fluorophenyl)ethyl]-N-(furan-2-ylmethyl)pyrrolo[3,2-b]quinoxaline-3-carboxamide SMR000148409 | cid_2009147
Type:
Small organic molecule
Emp. Form.:
C24H20FN5O2
Mol. Mass.:
429.4463
SMILES:
Nc1c(C(=O)NCc2ccco2)c2nc3ccccc3nc2n1CCc1ccccc1F
:
Substrate
Name:
Core-binding factor subunit beta isoform 2
Synonyms:
CBFB PEBB_HUMAN Venus-core-binding factor subunit beta-smooth muscle myosin heavy chain
Type:
Fluorescent fusion protein
Mol. Mass.:
21988.19
Organism:
Homo sapiens (Human)
Description:
Q13951-2
Residue:
187