Target
Runt-related transcription factor 1
Ligand
BDBM29680
Substrate
Venus-CBFbeta-SMMHC
Meas. Tech.
uHTS identification of compounds inhibiting the binding between the RUNX1 Runt domain and CBFb-SMMHC via a fluorescence resonance energy transfer (FRET) assay.
pH
7.4±n/a
Temperature
296.15±n/a K
IC50
19300±n/a nM
Citation
 PubChem, PC uHTS identification of compounds inhibiting the binding between the RUNX1 Runt domain and CBFbeta-SMMHC via a fluorescence resonance energy transfer (FRET) assay. PubChem Bioassay (2009)[AID] 
Target
Name:
Runt-related transcription factor 1
Synonyms:
AML1 CBF-alpha-2 Core-binding factor subunit alpha-2 Polyomavirus enhancer-binding protein 2 alpha B subunit RUNX1_HUMAN | Runt-Related Transcription Factor 1 Isoform AML1C
Type:
Subunit of heterodimeric transcription factor
Mol. Mass.:
48750.25
Organism:
Homo sapiens (Human)
Description:
Q01196
Residue:
453
  
Inhibitor
Name:
BDBM29680
Synonyms:
2-[(6,7-dihydroxy-2-keto-chromen-4-yl)methylthio]-3-(3-methoxyphenyl)quinazolin-4-one 2-[(6,7-dihydroxy-2-oxochromen-4-yl)methylsulfanyl]-3-(3-methoxyphenyl)quinazolin-4-one MLS000409303 cid_5691857
Type:
Small organic molecule
Emp. Form.:
C25H18N2O6S
Mol. Mass.:
474.485
SMILES:
COc1cccc(c1)-n1c(SCc2cc(=O)oc3cc(O)c(O)cc23)nc2ccccc2c1=O
:
Substrate
Name:
Core-binding factor subunit beta isoform 2
Synonyms:
CBFB PEBB_HUMAN Venus-core-binding factor subunit beta-smooth muscle myosin heavy chain
Type:
Fluorescent fusion protein
Mol. Mass.:
21988.19
Organism:
Homo sapiens (Human)
Description:
Q13951-2
Residue:
187