Target
Runt-related transcription factor 1
Ligand
BDBM29683
Substrate
Venus-CBFbeta-SMMHC
Meas. Tech.
uHTS identification of compounds inhibiting the binding between the RUNX1 Runt domain and CBFb-SMMHC via a fluorescence resonance energy transfer (FRET) assay.
pH
7.4±n/a
Temperature
296.15±n/a K
IC50
56100±n/a nM
Citation
 PubChem, PC uHTS identification of compounds inhibiting the binding between the RUNX1 Runt domain and CBFbeta-SMMHC via a fluorescence resonance energy transfer (FRET) assay. PubChem Bioassay (2009)[AID] 
Target
Name:
Runt-related transcription factor 1
Synonyms:
AML1 CBF-alpha-2 Core-binding factor subunit alpha-2 Polyomavirus enhancer-binding protein 2 alpha B subunit RUNX1_HUMAN | Runt-Related Transcription Factor 1 Isoform AML1C
Type:
Subunit of heterodimeric transcription factor
Mol. Mass.:
48750.25
Organism:
Homo sapiens (Human)
Description:
Q01196
Residue:
453
  
Inhibitor
Name:
BDBM29683
Synonyms:
MLS000666106 N-[3-cyano-1-(2-furfuryl)-5-keto-dipyrido[1,2-d:3',4'-f]pyrimidin-2-ylidene]-2-furamide N-[3-cyano-1-(furan-2-ylmethyl)-5-oxidanylidene-dipyrido[1,2-d:3',4'-f]pyrimidin-2-ylidene]furan-2-carboxamide SMR000271415 | cid_1279881
Type:
Small organic molecule
Emp. Form.:
C22H13N5O4
Mol. Mass.:
411.3697
SMILES:
O=C(\N=c1/c(cc2c(nc3ccccn3c2=O)n1Cc1ccco1)C#N)c1ccco1
:
Substrate
Name:
Core-binding factor subunit beta isoform 2
Synonyms:
CBFB PEBB_HUMAN Venus-core-binding factor subunit beta-smooth muscle myosin heavy chain
Type:
Fluorescent fusion protein
Mol. Mass.:
21988.19
Organism:
Homo sapiens (Human)
Description:
Q13951-2
Residue:
187