Target
5-hydroxytryptamine receptor 1A
Ligand
BDBM30891
Substrate
Not Available
Meas. Tech.
Dose Response Assay for Agonists of 5-Hydroxytryptamine (Serotonin) Receptor Subtype 1A (5HT1A)
pH
7.4±n/a
Temperature
296.15±n/a K
EC50
5900±n/a nM
Citation
 PubChem, PC Dose Response Assay for 5-Hydroxytryptamine (Serotonin) Receptor Subtype 1a (5HT1a) Agonists PubChem Bioassay (2007)[AID] 
Target
Name:
5-hydroxytryptamine receptor 1A
Synonyms:
5-HT-1A 5-hydroxytryptamine receptor 1A (5-HT-1A) ADRB2RL1 Dopamine D2 receptor and serotonin 1a receptor HTR1A | Serotonin receptor 1A
Type:
Mol. Mass.:
46122.49
Organism:
Homo sapiens (Human)
Description:
Residue:
422
  
Inhibitor
Name:
BDBM30891
Synonyms:
MLS000049147 N-(2-furfuryl)-7-hydroxy-2-keto-chromene-3-carboxamide N-(furan-2-ylmethyl)-7-hydroxy-2-oxochromene-3-carboxamide SMR000074483 | cid_5398663
Type:
Small organic molecule
Emp. Form.:
C15H11NO5
Mol. Mass.:
285.2515
SMILES:
Oc1ccc2cc(C(=O)NCc3ccco3)c(=O)oc2c1
:
Substrate
Name:
Not Available
Synonyms:
Type:
Mol. Mass.:
358.43
Organism:
Description:
Residue:
3
NA