Target
5-hydroxytryptamine receptor 1A
Ligand
BDBM31067
Substrate
Not Available
Meas. Tech.
Dose Response Assay for Agonists of 5-Hydroxytryptamine (Serotonin) Receptor Subtype 1A (5HT1A)
pH
7.4±n/a
Temperature
296.15±n/a K
IC50
3592±n/a nM
Citation
 PubChem, PC Dose Response Cell Based Assay for Antagonists of the 5-Hydroxytryptamine Receptor Subtype 1A (5HT1A) PubChem Bioassay (2007)[AID] 
Target
Name:
5-hydroxytryptamine receptor 1A
Synonyms:
5-HT-1A 5-hydroxytryptamine receptor 1A (5-HT-1A) ADRB2RL1 Dopamine D2 receptor and serotonin 1a receptor HTR1A | Serotonin receptor 1A
Type:
Mol. Mass.:
46122.49
Organism:
Homo sapiens (Human)
Description:
Residue:
422
  
Inhibitor
Name:
BDBM31067
Synonyms:
4-(3,4-dimethoxyphenyl)-2-(methylsulfonyl)-6-(trifluoromethyl)pyrimidine 4-(3,4-dimethoxyphenyl)-2-methylsulfonyl-6-(trifluoromethyl)pyrimidine SMR000022592 | cid_3244140
Type:
Small organic molecule
Emp. Form.:
C14H13F3N2O4S
Mol. Mass.:
362.324
SMILES:
COc1ccc(cc1OC)-c1cc(nc(n1)S(C)(=O)=O)C(F)(F)F
:
Substrate
Name:
Not Available
Synonyms:
Type:
Mol. Mass.:
358.43
Organism:
Description:
Residue:
3
NA