Target
5-hydroxytryptamine receptor 1E
Ligand
BDBM31013
Substrate
Not Available
Meas. Tech.
Dose Response Cell Based High Throughput Screening Assay for Agonists of the 5-Hydroxytryptamine Receptor Subtype 1E (5HT1E)
pH
7.4±n/a
Temperature
296.15±n/a K
EC50
50000±n/a nM
Citation
 PubChem, PC Dose Response Cell Based High Throughput Screening Assay for Agonists of the 5-Hydroxytryptamine Receptor Subtype 1E (5HT1E) PubChem Bioassay (2007)[AID] 
Target
Name:
5-hydroxytryptamine receptor 1E
Synonyms:
5-HT-1E 5-Hydroxytryptamine Receptor Subtype 1E (5HT1E) 5-hydroxytryptamine receptor 1E (5-HT-1E) (S31) 5HT1E_HUMAN S31 Serotonin 1e (5-HT1e) receptor | Serotonin Receptor 1E
Type:
G Protein-Coupled Receptor (GPCR)
Mol. Mass.:
41697.80
Organism:
Homo sapiens (Human)
Description:
gi_112822
Residue:
365
  
Inhibitor
Name:
BDBM31013
Synonyms:
4-[(3,5-dimethyl-4-isoxazolyl)methoxy]benzoic acid [1-[4-(4-morpholinyl)anilino]-1-oxopropan-2-yl] ester MLS000056068 [1-(4-morpholin-4-ylanilino)-1-oxopropan-2-yl] 4-[(3,5-dimethyl-1,2-oxazol-4-yl)methoxy]benzoate cid_2998209
Type:
Small organic molecule
Emp. Form.:
C26H29N3O6
Mol. Mass.:
479.525
SMILES:
CC(OC(=O)c1ccc(OCc2c(C)noc2C)cc1)C(=O)Nc1ccc(cc1)N1CCOCC1
:
Substrate
Name:
Not Available
Synonyms:
Type:
Mol. Mass.:
358.43
Organism:
Description:
Residue:
3
NA