Target
5-hydroxytryptamine receptor 1E
Ligand
BDBM31028
Substrate
Not Available
Meas. Tech.
Dose Response Cell Based High Throughput Screening Assay for Agonists of the 5-Hydroxytryptamine Receptor Subtype 1E (5HT1E)
pH
7.4±n/a
Temperature
296.15±n/a K
EC50
50000±n/a nM
Citation
 PubChem, PC Dose Response Cell Based High Throughput Screening Assay for Agonists of the 5-Hydroxytryptamine Receptor Subtype 1E (5HT1E) PubChem Bioassay (2007)[AID] 
Target
Name:
5-hydroxytryptamine receptor 1E
Synonyms:
5-HT-1E 5-Hydroxytryptamine Receptor Subtype 1E (5HT1E) 5-hydroxytryptamine receptor 1E (5-HT-1E) (S31) 5HT1E_HUMAN S31 Serotonin 1e (5-HT1e) receptor | Serotonin Receptor 1E
Type:
G Protein-Coupled Receptor (GPCR)
Mol. Mass.:
41697.80
Organism:
Homo sapiens (Human)
Description:
gi_112822
Residue:
365
  
Inhibitor
Name:
BDBM31028
Synonyms:
3-[2-(4-carbethoxypiperidino)-2-keto-ethyl]-1-methyl-indole-2-carboxylic acid 3-[2-(4-ethoxycarbonylpiperidin-1-yl)-2-oxidanylidene-ethyl]-1-methyl-indole-2-carboxylic acid 3-{2-[4-(ethoxycarbonyl)piperidin-1-yl]-2-oxoethyl}-1-methyl-1H-indole-2-carboxylic acid SMR000021788 | cid_3241730
Type:
Small organic molecule
Emp. Form.:
C20H24N2O5
Mol. Mass.:
372.415
SMILES:
CCOC(=O)C1CCN(CC1)C(=O)Cc1c(C(O)=O)n(C)c2ccccc12
:
Substrate
Name:
Not Available
Synonyms:
Type:
Mol. Mass.:
358.43
Organism:
Description:
Residue:
3
NA