Target
5-hydroxytryptamine receptor 1E
Ligand
BDBM31347
Substrate
Not Available
Meas. Tech.
Counterscreen assay for S1P3 antagonists: Dose response cell-based high throughput screening assay to identify antagonists of the 5-Hydroxytryptamine Receptor Subtype 1E (5HT1E)
pH
7.4±n/a
Temperature
296.15±n/a K
IC50
1755±n/a nM
Citation
 PubChem, PC Counterscreen assay for S1P3 antagonists: Dose response cell-based high throughput screening assay to identify antagonists of the 5-Hydroxytryptamine Receptor Subtype 1E (5HT1E) PubChem Bioassay (2009)[AID] 
Target
Name:
5-hydroxytryptamine receptor 1E
Synonyms:
5-HT-1E 5-Hydroxytryptamine Receptor Subtype 1E (5HT1E) 5-hydroxytryptamine receptor 1E (5-HT-1E) (S31) 5HT1E_HUMAN S31 Serotonin 1e (5-HT1e) receptor | Serotonin Receptor 1E
Type:
G Protein-Coupled Receptor (GPCR)
Mol. Mass.:
41697.80
Organism:
Homo sapiens (Human)
Description:
gi_112822
Residue:
365
  
Inhibitor
Name:
BDBM31347
Synonyms:
2-(3,4-dimethoxyphenyl)-N-[3-[5-(3-methylphenyl)-1,3,4-oxadiazol-2-yl]phenyl]acetamide 2-(3,4-dimethoxyphenyl)-N-[3-[5-(m-tolyl)-1,3,4-oxadiazol-2-yl]phenyl]acetamide MLS000052465 cid_2233014
Type:
Small organic molecule
Emp. Form.:
C25H23N3O4
Mol. Mass.:
429.4678
SMILES:
COc1ccc(CC(=O)Nc2cccc(c2)-c2nnc(o2)-c2cccc(C)c2)cc1OC
:
Substrate
Name:
Not Available
Synonyms:
Type:
Mol. Mass.:
358.43
Organism:
Description:
Residue:
3
NA