Target
5-hydroxytryptamine receptor 1E
Ligand
BDBM31349
Substrate
Not Available
Meas. Tech.
Counterscreen assay for S1P3 antagonists: Dose response cell-based high throughput screening assay to identify antagonists of the 5-Hydroxytryptamine Receptor Subtype 1E (5HT1E)
pH
7.4±n/a
Temperature
296.15±n/a K
IC50
15650±n/a nM
Citation
 PubChem, PC Counterscreen assay for S1P3 antagonists: Dose response cell-based high throughput screening assay to identify antagonists of the 5-Hydroxytryptamine Receptor Subtype 1E (5HT1E) PubChem Bioassay (2009)[AID] 
Target
Name:
5-hydroxytryptamine receptor 1E
Synonyms:
5-HT-1E 5-Hydroxytryptamine Receptor Subtype 1E (5HT1E) 5-hydroxytryptamine receptor 1E (5-HT-1E) (S31) 5HT1E_HUMAN S31 Serotonin 1e (5-HT1e) receptor | Serotonin Receptor 1E
Type:
G Protein-Coupled Receptor (GPCR)
Mol. Mass.:
41697.80
Organism:
Homo sapiens (Human)
Description:
gi_112822
Residue:
365
  
Inhibitor
Name:
BDBM31349
Synonyms:
3-(2-ethylanilino)-2-(2-furanylmethyl)-3H-isoindol-1-one 3-(2-ethylanilino)-2-(furan-2-ylmethyl)-3H-isoindol-1-one MLS000116909 cid_5307823
Type:
Small organic molecule
Emp. Form.:
C21H20N2O2
Mol. Mass.:
332.3957
SMILES:
CCc1ccccc1NC1N(Cc2ccco2)C(=O)c2ccccc12
:
Substrate
Name:
Not Available
Synonyms:
Type:
Mol. Mass.:
358.43
Organism:
Description:
Residue:
3
NA