Target
5-hydroxytryptamine receptor 1E
Ligand
BDBM31357
Substrate
Not Available
Meas. Tech.
Counterscreen assay for S1P3 antagonists: Dose response cell-based high throughput screening assay to identify antagonists of the 5-Hydroxytryptamine Receptor Subtype 1E (5HT1E)
pH
7.4±n/a
Temperature
296.15±n/a K
IC50
13370±n/a nM
Citation
 PubChem, PC Counterscreen assay for S1P3 antagonists: Dose response cell-based high throughput screening assay to identify antagonists of the 5-Hydroxytryptamine Receptor Subtype 1E (5HT1E) PubChem Bioassay (2009)[AID] 
Target
Name:
5-hydroxytryptamine receptor 1E
Synonyms:
5-HT-1E 5-Hydroxytryptamine Receptor Subtype 1E (5HT1E) 5-hydroxytryptamine receptor 1E (5-HT-1E) (S31) 5HT1E_HUMAN S31 Serotonin 1e (5-HT1e) receptor | Serotonin Receptor 1E
Type:
G Protein-Coupled Receptor (GPCR)
Mol. Mass.:
41697.80
Organism:
Homo sapiens (Human)
Description:
gi_112822
Residue:
365
  
Inhibitor
Name:
BDBM31357
Synonyms:
2,5-dimethyl-3-furancarboxylic acid [2-(3-chloro-4-methylanilino)-2-oxo-1-phenylethyl] ester MLS000409023 [2-(3-chloro-4-methylanilino)-2-oxo-1-phenylethyl] 2,5-dimethylfuran-3-carboxylate cid_3893874
Type:
Small organic molecule
Emp. Form.:
C22H20ClNO4
Mol. Mass.:
397.852
SMILES:
Cc1cc(C(=O)OC(C(=O)Nc2ccc(C)c(Cl)c2)c2ccccc2)c(C)o1
:
Substrate
Name:
Not Available
Synonyms:
Type:
Mol. Mass.:
358.43
Organism:
Description:
Residue:
3
NA