Target
5-hydroxytryptamine receptor 1E
Ligand
BDBM31359
Substrate
Not Available
Meas. Tech.
Counterscreen assay for S1P3 antagonists: Dose response cell-based high throughput screening assay to identify antagonists of the 5-Hydroxytryptamine Receptor Subtype 1E (5HT1E)
pH
7.4±n/a
Temperature
296.15±n/a K
IC50
13380±n/a nM
Citation
 PubChem, PC Counterscreen assay for S1P3 antagonists: Dose response cell-based high throughput screening assay to identify antagonists of the 5-Hydroxytryptamine Receptor Subtype 1E (5HT1E) PubChem Bioassay (2009)[AID] 
Target
Name:
5-hydroxytryptamine receptor 1E
Synonyms:
5-HT-1E 5-Hydroxytryptamine Receptor Subtype 1E (5HT1E) 5-hydroxytryptamine receptor 1E (5-HT-1E) (S31) 5HT1E_HUMAN S31 Serotonin 1e (5-HT1e) receptor | Serotonin Receptor 1E
Type:
G Protein-Coupled Receptor (GPCR)
Mol. Mass.:
41697.80
Organism:
Homo sapiens (Human)
Description:
gi_112822
Residue:
365
  
Inhibitor
Name:
BDBM31359
Synonyms:
MLS000334870 N-(3-chloro-4-methyl-phenyl)-2-(4-nitrophenyl)propionamide SMR000249628 | cid_5038554
Type:
Small organic molecule
Emp. Form.:
C16H15ClN2O3
Mol. Mass.:
318.755
SMILES:
CC(C(=O)Nc1ccc(C)c(Cl)c1)c1ccc(cc1)[N+]([O-])=O
:
Substrate
Name:
Not Available
Synonyms:
Type:
Mol. Mass.:
358.43
Organism:
Description:
Residue:
3
NA