Target
Heat shock protein HSP 90-alpha
Ligand
BDBM32086
Substrate
cy3B-GM
Meas. Tech.
Tumor Hsp90 Inhibitors Dose Response Confirmation
pH
7.4±n/a
Temperature
296.15±n/a K
IC50
4652.2±n/a nM
Citation
 PubChem, PC Tumor Hsp90 Inhibitors Dose Response Confirmation PubChem Bioassay (2007)[AID] 
Target
Name:
Heat shock protein HSP 90-alpha
Synonyms:
HS90A_HUMAN HSP86 HSP90AA1 HSPCA Heat shock 86 kDa Heat shock protein HSP 90-alpha (HSP90) LAP-2 Lipopolysaccharide-associated protein 2 heat shock protein 90kDa alpha (cytosolic), class A member 1 isoform 2
Type:
Molecular Chaperone
Mol. Mass.:
84623.45
Organism:
Homo sapiens (Human)
Description:
P07900
Residue:
732
  
Inhibitor
Name:
BDBM32086
Synonyms:
2-methyl-3-{[(3-morpholin-4-ylpropyl)amino]carbonyl}naphtho[1,2-b]furan-5-yl acetate SMR000020715 [2-methyl-3-(3-morpholin-4-ylpropylcarbamoyl)benzo[g][1]benzofuran-5-yl] ethanoate acetic acid [2-methyl-3-[[3-(4-morpholinyl)propylamino]-oxomethyl]-5-benzo[g]benzofuranyl] ester | cid_2142320
Type:
Small organic molecule
Emp. Form.:
C23H26N2O5
Mol. Mass.:
410.4629
SMILES:
CC(=O)Oc1cc2c(C(=O)NCCCN3CCOCC3)c(C)oc2c2ccccc12
:
Substrate
Name:
cy3B-GM
Synonyms:
fluorescently (Cy3B) labeled geldanamycin
Type:
fluorescent probe
Mol. Mass.:
358.43
Organism:
Description:
Residue:
3
NA