Target
Isoform Bcl-X(L) of Bcl-2-like protein 1 (Bcl-xL)
Ligand
BDBM32295
Substrate
F-Bim
Meas. Tech.
Multiplexed dose response screen for small molecule regulators of Bcl-2 family protein interactions, specifically Bim-Bcl-XL.
pH
7.4±n/a
Temperature
277.15±n/a K
EC50
29550±n/a nM
Citation
 PubChem, PC Multiplexed dose response screen for small molecule regulators of Bcl-2 family protein interactions, specifically Bim-Bcl-XL. PubChem Bioassay (2008)[AID] 
Target
Name:
Isoform Bcl-X(L) of Bcl-2-like protein 1 (Bcl-xL)
Synonyms:
B-cell lymphoma-extra large protein (Bcl-xL) BCL-xL BCL2L1 Bcl-2-like protein 1 (Bcl-xL) | Isoform Bcl-X(L)
Type:
Homodimers/heterodimers with BAX, BAK and BCL2
Mol. Mass.:
26053.63
Organism:
Homo sapiens (Human)
Description:
gi_510901
Residue:
233
  
Inhibitor
Name:
BDBM32295
Synonyms:
(5Z)-3-ethyl-5-[(2E)-2-(1-ethyl-4-quinolinylidene)ethylidene]-2-sulfanylidene-4-thiazolidinone (5Z)-3-ethyl-5-[(2E)-2-(1-ethylquinolin-4-ylidene)ethylidene]-2-sulfanylidene-1,3-thiazolidin-4-one MLS000574570 cid_1989678
Type:
Small organic molecule
Emp. Form.:
C18H18N2OS2
Mol. Mass.:
342.478
SMILES:
CCN1C(=S)S\C(=C/C=C2\C=CN(CC)c3ccccc23)C1=O
:
Substrate
Name:
F-Bim
Synonyms:
Type:
fluorescent peptide probe
Mol. Mass.:
3923.40
Organism:
Description:
Residue:
32