Target
Isoform Bcl-X(L) of Bcl-2-like protein 1 (Bcl-xL)
Ligand
BDBM32330
Substrate
F-Bim
Meas. Tech.
Multiplexed dose response screen for small molecule regulators of Bcl-2 family protein interactions, specifically Bim-Bcl-XL.
pH
7.4±n/a
Temperature
277.15±n/a K
EC50
1660±n/a nM
Citation
 PubChem, PC Multiplexed dose response screen for small molecule regulators of Bcl-2 family protein interactions, specifically Bim-Bcl-XL. PubChem Bioassay (2008)[AID] 
Target
Name:
Isoform Bcl-X(L) of Bcl-2-like protein 1 (Bcl-xL)
Synonyms:
B-cell lymphoma-extra large protein (Bcl-xL) BCL-xL BCL2L1 Bcl-2-like protein 1 (Bcl-xL) | Isoform Bcl-X(L)
Type:
Homodimers/heterodimers with BAX, BAK and BCL2
Mol. Mass.:
26053.63
Organism:
Homo sapiens (Human)
Description:
gi_510901
Residue:
233
  
Inhibitor
Name:
BDBM32330
Synonyms:
(2Z)-2-(5-fluoranyl-2-oxidanylidene-indol-3-yl)-2-(4-methyl-3H-1,3-thiazol-2-ylidene)ethanenitrile (2Z)-2-(5-fluoro-2-oxo-3-indolyl)-2-(4-methyl-3H-thiazol-2-ylidene)acetonitrile MLS001011168 cid_16196155
Type:
Small organic molecule
Emp. Form.:
C14H8FN3OS
Mol. Mass.:
285.296
SMILES:
Cc1csc(n1)C(C#N)=C1C(=O)Nc2ccc(F)cc12
:
Substrate
Name:
F-Bim
Synonyms:
Type:
fluorescent peptide probe
Mol. Mass.:
3923.40
Organism:
Description:
Residue:
32