Target
Coagulation factor XI
Ligand
BDBM32686
Substrate
Boc-Glu-Ala-Arg-AMC
Meas. Tech.
Factor XIa Dose Response Confirmation from Single Well Screen
pH
7.4±n/a
Temperature
296.15±n/a K
IC50
>50000±0 nM
Citation
 PubChem, PC Factor XIa Dose Response Confirmation from Single Well Screen PubChem Bioassay (2008)[AID] 
Target
Name:
Coagulation factor XI
Synonyms:
Coagulation factor XIa Coagulation factor XIa light chain FA11_HUMAN Factor XIa PTA | Plasma thromboplastin antecedent
Type:
Enzyme
Mol. Mass.:
70130.58
Organism:
Homo sapiens (Human)
Description:
P03951
Residue:
625
  
Inhibitor
Name:
BDBM32686
Synonyms:
4-(2-Morpholin-4-yl-2-oxo-ethoxy)-N-p-tolyl-benzenesulfonamide CHEMBL235929 N-(4-methylphenyl)-4-(2-morpholin-4-yl-2-oxidanylidene-ethoxy)benzenesulfonamide N-(4-methylphenyl)-4-[2-(4-morpholinyl)-2-oxoethoxy]benzenesulfonamide cid_1092897
Type:
Small organic molecule
Emp. Form.:
C19H22N2O5S
Mol. Mass.:
390.453
SMILES:
Cc1ccc(NS(=O)(=O)c2ccc(OCC(=O)N3CCOCC3)cc2)cc1
:
Substrate
Name:
Boc-Glu-Ala-Arg-AMC
Synonyms:
Type:
fluorescent substrate peptide
Mol. Mass.:
358.43
Organism:
Description:
Residue:
3
NA