Target
Coagulation factor XI
Ligand
BDBM32717
Substrate
Boc-Glu-Ala-Arg-AMC
Meas. Tech.
Factor XIa Dose Response Confirmation from Single Well Screen
pH
7.4±n/a
Temperature
296.15±n/a K
IC50
21425.1±3538.26 nM
Citation
 PubChem, PC Factor XIa Dose Response Confirmation from Single Well Screen PubChem Bioassay (2008)[AID] 
Target
Name:
Coagulation factor XI
Synonyms:
Coagulation factor XIa Coagulation factor XIa light chain FA11_HUMAN Factor XIa PTA | Plasma thromboplastin antecedent
Type:
Enzyme
Mol. Mass.:
70130.58
Organism:
Homo sapiens (Human)
Description:
P03951
Residue:
625
  
Inhibitor
Name:
BDBM32717
Synonyms:
4-fluoranyl-N-(2-morpholin-4-ylcarbonylphenyl)benzamide 4-fluoro-N-[2-(morpholine-4-carbonyl)phenyl]benzamide MLS000534877 cid_895439
Type:
Small organic molecule
Emp. Form.:
C18H17FN2O3
Mol. Mass.:
328.3376
SMILES:
Fc1ccc(cc1)C(=O)Nc1ccccc1C(=O)N1CCOCC1
:
Substrate
Name:
Boc-Glu-Ala-Arg-AMC
Synonyms:
Type:
fluorescent substrate peptide
Mol. Mass.:
358.43
Organism:
Description:
Residue:
3
NA