Target
Coagulation factor XI
Ligand
BDBM32719
Substrate
Boc-Glu-Ala-Arg-AMC
Meas. Tech.
Factor XIa Dose Response Confirmation from Single Well Screen
pH
7.4±n/a
Temperature
296.15±n/a K
IC50
>50000±0 nM
Citation
 PubChem, PC Factor XIa Dose Response Confirmation from Single Well Screen PubChem Bioassay (2008)[AID] 
Target
Name:
Coagulation factor XI
Synonyms:
Coagulation factor XIa Coagulation factor XIa light chain FA11_HUMAN Factor XIa PTA | Plasma thromboplastin antecedent
Type:
Enzyme
Mol. Mass.:
70130.58
Organism:
Homo sapiens (Human)
Description:
P03951
Residue:
625
  
Inhibitor
Name:
BDBM32719
Synonyms:
5-ethyl-1,3-dimethyl-5-phenyl-1,3-diazinane-2,4,6-trione 5-ethyl-1,3-dimethyl-5-phenyl-barbituric acid SMR000137105 | cid_12897
Type:
Small organic molecule
Emp. Form.:
C14H16N2O3
Mol. Mass.:
260.2884
SMILES:
CCC1(C(=O)N(C)C(=O)N(C)C1=O)c1ccccc1
:
Substrate
Name:
Boc-Glu-Ala-Arg-AMC
Synonyms:
Type:
fluorescent substrate peptide
Mol. Mass.:
358.43
Organism:
Description:
Residue:
3
NA