Target
Coagulation factor XI
Ligand
BDBM32739
Substrate
Boc-Glu-Ala-Arg-AMC
Meas. Tech.
Factor XIa Dose Response Confirmation from Single Well Screen
pH
7.4±n/a
Temperature
296.15±n/a K
IC50
>50000±0 nM
Citation
 PubChem, PC Factor XIa Dose Response Confirmation from Single Well Screen PubChem Bioassay (2008)[AID] 
Target
Name:
Coagulation factor XI
Synonyms:
Coagulation factor XIa Coagulation factor XIa light chain FA11_HUMAN Factor XIa PTA | Plasma thromboplastin antecedent
Type:
Enzyme
Mol. Mass.:
70130.58
Organism:
Homo sapiens (Human)
Description:
P03951
Residue:
625
  
Inhibitor
Name:
BDBM32739
Synonyms:
Benzofuran-2-carboxylic acid (1,5-dimethyl-3-oxo-2-phenyl-2,3-dihydro-1H-pyrazol-4-yl)-amide N-(1,5-dimethyl-3-oxidanylidene-2-phenyl-pyrazol-4-yl)-1-benzofuran-2-carboxamide N-(1,5-dimethyl-3-oxo-2-phenylpyrazol-4-yl)-1-benzofuran-2-carboxamide SMR000147839 | cid_709529
Type:
Small organic molecule
Emp. Form.:
C20H17N3O3
Mol. Mass.:
347.3673
SMILES:
Cc1c(NC(=O)c2cc3ccccc3o2)c(=O)n(-c2ccccc2)n1C
:
Substrate
Name:
Boc-Glu-Ala-Arg-AMC
Synonyms:
Type:
fluorescent substrate peptide
Mol. Mass.:
358.43
Organism:
Description:
Residue:
3
NA