Target
Coagulation factor XI
Ligand
BDBM32746
Substrate
Boc-Glu-Ala-Arg-AMC
Meas. Tech.
Factor XIa Dose Response Confirmation from Single Well Screen
pH
7.4±n/a
Temperature
296.15±n/a K
IC50
7436.43±930.59 nM
Citation
 PubChem, PC Factor XIa Dose Response Confirmation from Single Well Screen PubChem Bioassay (2008)[AID] 
Target
Name:
Coagulation factor XI
Synonyms:
Coagulation factor XIa Coagulation factor XIa light chain FA11_HUMAN Factor XIa PTA | Plasma thromboplastin antecedent
Type:
Enzyme
Mol. Mass.:
70130.58
Organism:
Homo sapiens (Human)
Description:
P03951
Residue:
625
  
Inhibitor
Name:
BDBM32746
Synonyms:
1-(4-acetyl-3,5-dimethyl-1H-pyrrol-2-yl)-2-[(4-ethyl-5-phenyl-1,2,4-triazol-3-yl)sulfanyl]ethanone 1-(4-ethanoyl-3,5-dimethyl-1H-pyrrol-2-yl)-2-[(4-ethyl-5-phenyl-1,2,4-triazol-3-yl)sulfanyl]ethanone SMR000153346 | cid_2090286
Type:
Small organic molecule
Emp. Form.:
C20H22N4O2S
Mol. Mass.:
382.479
SMILES:
CCn1c(SCC(=O)c2[nH]c(C)c(C(C)=O)c2C)nnc1-c1ccccc1
:
Substrate
Name:
Boc-Glu-Ala-Arg-AMC
Synonyms:
Type:
fluorescent substrate peptide
Mol. Mass.:
358.43
Organism:
Description:
Residue:
3
NA