Target
Coagulation factor XI
Ligand
BDBM32831
Substrate
Boc-Glu-Ala-Arg-AMC
Meas. Tech.
Factor XIa 1536 HTS Dose Response Confirmation
pH
7.4±n/a
Temperature
296.15±n/a K
IC50
2040.836667±3534.83279 nM
Citation
 PubChem, PC Factor XIa 1536 HTS Dose Response Confirmation PubChem Bioassay (2008)[AID] 
Target
Name:
Coagulation factor XI
Synonyms:
Coagulation factor XIa Coagulation factor XIa light chain FA11_HUMAN Factor XIa PTA | Plasma thromboplastin antecedent
Type:
Enzyme
Mol. Mass.:
70130.58
Organism:
Homo sapiens (Human)
Description:
P03951
Residue:
625
  
Inhibitor
Name:
BDBM32831
Synonyms:
(5-methylsulfanyl-3-phenyl-1,2,4-triazol-1-yl)-phenyl-methanone 1-benzoyl-3-phenyl-1H-1,2,4-triazol-5-ylmethylsulfide SMR000162940 [5-(methylthio)-3-phenyl-1,2,4-triazol-1-yl]-phenylmethanone | cid_5069358
Type:
Small organic molecule
Emp. Form.:
C16H13N3OS
Mol. Mass.:
295.359
SMILES:
CSc1nc(nn1C(=O)c1ccccc1)-c1ccccc1
:
Substrate
Name:
Boc-Glu-Ala-Arg-AMC
Synonyms:
Type:
fluorescent substrate peptide
Mol. Mass.:
358.43
Organism:
Description:
Residue:
3
NA