Target
Bcl-2-related protein A1
Ligand
BDBM33043
Substrate
FITC-conjugated-Bim BH3 Peptide
Meas. Tech.
Multiplexed dose response screen for small molecule regulators of Bcl-2 family protein interactions, specifically Bim-Bfl-1.
pH
7.4±n/a
Temperature
277.15±n/a K
EC50
2440±n/a nM
Citation
 PubChem, PC Multiplexed dose response screen for small molecule regulators of Bcl-2 family protein interactions, specifically Bim-Bfl-1. PubChem Bioassay (2008)[AID] 
Target
Name:
Bcl-2-related protein A1
Synonyms:
B2LA1_HUMAN BCL2L5 Bcl-2-like protein 5 HBPA1 Protein BFL-1 | Protein GRS
Type:
Apoptosis regulator protein
Mol. Mass.:
20130.01
Organism:
Homo sapiens (Human)
Description:
Residue:
175
  
Inhibitor
Name:
BDBM33043
Synonyms:
2-amino-6-(4-fluorophenyl)-4-(5-methyl-2-furanyl)-3-pyridinecarbonitrile 2-amino-6-(4-fluorophenyl)-4-(5-methylfuran-2-yl)pyridine-3-carbonitrile MLS000082831 cid_665592
Type:
Small organic molecule
Emp. Form.:
C17H12FN3O
Mol. Mass.:
293.2951
SMILES:
Cc1ccc(o1)-c1cc(nc(N)c1C#N)-c1ccc(F)cc1
:
Substrate
Name:
FITC-conjugated-Bim BH3 Peptide
Synonyms:
FITC-Ahx-DMRPEIWIAQELRRIGDEFNAYYAR-OH
Type:
FITC-labeled Peptide
Mol. Mass.:
3112.46
Organism:
Description:
Residue:
25