Target
Bcl-2-related protein A1
Ligand
BDBM33093
Substrate
FITC-conjugated-Bim BH3 Peptide
Meas. Tech.
Multiplexed dose response screen for small molecule regulators of Bcl-2 family protein interactions, specifically Bim-Bfl-1.
pH
7.4±n/a
Temperature
277.15±n/a K
EC50
1120±n/a nM
Citation
 PubChem, PC Multiplexed dose response screen for small molecule regulators of Bcl-2 family protein interactions, specifically Bim-Bfl-1. PubChem Bioassay (2008)[AID] 
Target
Name:
Bcl-2-related protein A1
Synonyms:
B2LA1_HUMAN BCL2L5 Bcl-2-like protein 5 HBPA1 Protein BFL-1 | Protein GRS
Type:
Apoptosis regulator protein
Mol. Mass.:
20130.01
Organism:
Homo sapiens (Human)
Description:
Residue:
175
  
Inhibitor
Name:
BDBM33093
Synonyms:
MLS000537607 cid_990752 | dimethyl 8-phenylcyclopenta[ij]pyrido[2,1,6-de]quinolizine-4,5-dicarboxylate
Type:
Small organic molecule
Emp. Form.:
C24H17NO4
Mol. Mass.:
383.3961
SMILES:
COC(=O)c1c(C(=O)OC)c2cccc3cc(-c4ccccc4)c4ccc1c4n23
:
Substrate
Name:
FITC-conjugated-Bim BH3 Peptide
Synonyms:
FITC-Ahx-DMRPEIWIAQELRRIGDEFNAYYAR-OH
Type:
FITC-labeled Peptide
Mol. Mass.:
3112.46
Organism:
Description:
Residue:
25