Target
Bcl-2-related protein A1
Ligand
BDBM33151
Substrate
FITC-conjugated-Bim BH3 Peptide
Meas. Tech.
Multiplexed dose response screen for small molecule regulators of Bcl-2 family protein interactions, specifically Bim-Bfl-1.
pH
7.4±n/a
Temperature
277.15±n/a K
EC50
3860±n/a nM
Citation
 PubChem, PC Multiplexed dose response screen for small molecule regulators of Bcl-2 family protein interactions, specifically Bim-Bfl-1. PubChem Bioassay (2008)[AID] 
Target
Name:
Bcl-2-related protein A1
Synonyms:
B2LA1_HUMAN BCL2L5 Bcl-2-like protein 5 HBPA1 Protein BFL-1 | Protein GRS
Type:
Apoptosis regulator protein
Mol. Mass.:
20130.01
Organism:
Homo sapiens (Human)
Description:
Residue:
175
  
Inhibitor
Name:
BDBM33151
Synonyms:
(5Z)-3-(4-methoxyphenyl)-2-sulfanylidene-5-(thiophen-2-ylmethylidene)-4-imidazolidinone (5Z)-3-(4-methoxyphenyl)-5-(2-thenylidene)-2-thioxo-4-imidazolidinone MLS000698066 cid_5455628
Type:
Small organic molecule
Emp. Form.:
C15H12N2O2S2
Mol. Mass.:
316.398
SMILES:
COc1ccc(cc1)N1C(=S)NC(=Cc2cccs2)C1=O
:
Substrate
Name:
FITC-conjugated-Bim BH3 Peptide
Synonyms:
FITC-Ahx-DMRPEIWIAQELRRIGDEFNAYYAR-OH
Type:
FITC-labeled Peptide
Mol. Mass.:
3112.46
Organism:
Description:
Residue:
25