Target
Bcl-2-related protein A1
Ligand
BDBM33161
Substrate
FITC-conjugated-Bim BH3 Peptide
Meas. Tech.
Multiplexed dose response screen for small molecule regulators of Bcl-2 family protein interactions, specifically Bim-Bfl-1.
pH
7.4±n/a
Temperature
277.15±n/a K
EC50
15200±n/a nM
Citation
 PubChem, PC Multiplexed dose response screen for small molecule regulators of Bcl-2 family protein interactions, specifically Bim-Bfl-1. PubChem Bioassay (2008)[AID] 
Target
Name:
Bcl-2-related protein A1
Synonyms:
B2LA1_HUMAN BCL2L5 Bcl-2-like protein 5 HBPA1 Protein BFL-1 | Protein GRS
Type:
Apoptosis regulator protein
Mol. Mass.:
20130.01
Organism:
Homo sapiens (Human)
Description:
Residue:
175
  
Inhibitor
Name:
BDBM33161
Synonyms:
(8E)-4-(3-fluorophenyl)-8-[(3-fluorophenyl)methylidene]-6-methyl-1,3,4,5,6,7-hexahydroquinazoline-2-thione (8E)-8-(3-fluorobenzylidene)-4-(3-fluorophenyl)-6-methyl-3,4,5,6,7,8-hexahydroquinazoline-2(1H)-thione SMR000306148 | cid_6087863
Type:
Small organic molecule
Emp. Form.:
C22H20F2N2S
Mol. Mass.:
382.469
SMILES:
CC1CC2C(NC(=S)N=C2C(C1)=Cc1cccc(F)c1)c1cccc(F)c1
:
Substrate
Name:
FITC-conjugated-Bim BH3 Peptide
Synonyms:
FITC-Ahx-DMRPEIWIAQELRRIGDEFNAYYAR-OH
Type:
FITC-labeled Peptide
Mol. Mass.:
3112.46
Organism:
Description:
Residue:
25