Target
Bcl-2-related protein A1
Ligand
BDBM33185
Substrate
FITC-conjugated-Bim BH3 Peptide
Meas. Tech.
Multiplexed dose response screen for small molecule regulators of Bcl-2 family protein interactions, specifically Bim-Bfl-1.
pH
7.4±n/a
Temperature
277.15±n/a K
EC50
9210±n/a nM
Citation
 PubChem, PC Multiplexed dose response screen for small molecule regulators of Bcl-2 family protein interactions, specifically Bim-Bfl-1. PubChem Bioassay (2008)[AID] 
Target
Name:
Bcl-2-related protein A1
Synonyms:
B2LA1_HUMAN BCL2L5 Bcl-2-like protein 5 HBPA1 Protein BFL-1 | Protein GRS
Type:
Apoptosis regulator protein
Mol. Mass.:
20130.01
Organism:
Homo sapiens (Human)
Description:
Residue:
175
  
Inhibitor
Name:
BDBM33185
Synonyms:
4-({(4Z)-1-oxo-4-[(phenylsulfonyl)imino]-1,4-dihydronaphthalen-2-yl}amino)benzoic acid 4-[[(4Z)-4-besylimino-1-keto-2-naphthyl]amino]benzoic acid 4-[[4-(benzenesulfonylimino)-1-oxo-2-naphthalenyl]amino]benzoic acid MLS000686314 cid_4053104
Type:
Small organic molecule
Emp. Form.:
C23H16N2O5S
Mol. Mass.:
432.449
SMILES:
OC(=O)c1ccc(NC2=CC(=NS(=O)(=O)c3ccccc3)c3ccccc3C2=O)cc1
:
Substrate
Name:
FITC-conjugated-Bim BH3 Peptide
Synonyms:
FITC-Ahx-DMRPEIWIAQELRRIGDEFNAYYAR-OH
Type:
FITC-labeled Peptide
Mol. Mass.:
3112.46
Organism:
Description:
Residue:
25