Target
Prothrombin
Ligand
BDBM32796
Substrate
Boc-Val-Pro-Arg-AMC
Meas. Tech.
Thrombin 1536 HTS Dose Response Confirmation
pH
7.5±n/a
Temperature
296.15±n/a K
IC50
159.61±n/a nM
Citation
 PubChem, PC Thrombin 1536 HTS Dose Response Confirmation PubChem Bioassay (2008)[AID] 
Target
Name:
Prothrombin
Synonyms:
Activation peptide fragment 1 Coagulation factor II Prothrombin precursor Thrombin heavy chain | Thrombin light chain
Type:
Protein
Mol. Mass.:
70029.57
Organism:
Homo sapiens (Human)
Description:
P00734
Residue:
622
  
Inhibitor
Name:
BDBM32796
Synonyms:
MLS000115326 [3-(2-furanyl)-5-(methylthio)-1,2,4-triazol-1-yl]-(4-methylphenyl)methanone [3-(furan-2-yl)-5-methylsulfanyl-1,2,4-triazol-1-yl]-(4-methylphenyl)methanone | cid_1088428
Type:
Small organic molecule
Emp. Form.:
C15H13N3O2S
Mol. Mass.:
299.348
SMILES:
CSc1nc(nn1C(=O)c1ccc(C)cc1)-c1ccco1
:
Substrate
Name:
Boc-Val-Pro-Arg-AMC
Synonyms:
Type:
fluorogenic substrate
Mol. Mass.:
358.43
Organism:
Description:
Residue:
3
NA