Target
Prothrombin
Ligand
BDBM32824
Substrate
Boc-Val-Pro-Arg-AMC
Meas. Tech.
Thrombin 1536 HTS Dose Response Confirmation
pH
7.5±n/a
Temperature
296.15±n/a K
IC50
100±n/a nM
Citation
 PubChem, PC Thrombin 1536 HTS Dose Response Confirmation PubChem Bioassay (2008)[AID] 
Target
Name:
Prothrombin
Synonyms:
Activation peptide fragment 1 Coagulation factor II Prothrombin precursor Thrombin heavy chain | Thrombin light chain
Type:
Protein
Mol. Mass.:
70029.57
Organism:
Homo sapiens (Human)
Description:
P00734
Residue:
622
  
Inhibitor
Name:
BDBM32824
Synonyms:
(3-Amino-[1,2,4]triazol-4-yl)-(3,5-dimethoxy-phenyl)-methanone (3-azanyl-1,2,4-triazol-4-yl)-(3,5-dimethoxyphenyl)methanone SMR000148302 | cid_936917
Type:
Small organic molecule
Emp. Form.:
C11H12N4O3
Mol. Mass.:
248.238
SMILES:
COc1cc(OC)cc(c1)C(=O)n1cnnc1N
:
Substrate
Name:
Boc-Val-Pro-Arg-AMC
Synonyms:
Type:
fluorogenic substrate
Mol. Mass.:
358.43
Organism:
Description:
Residue:
3
NA