Target
Prothrombin
Ligand
BDBM32881
Substrate
Boc-Val-Pro-Arg-AMC
Meas. Tech.
Thrombin 1536 HTS Dose Response Confirmation
pH
7.5±n/a
Temperature
296.15±n/a K
IC50
1±n/a nM
Citation
 PubChem, PC Thrombin 1536 HTS Dose Response Confirmation PubChem Bioassay (2008)[AID] 
Target
Name:
Prothrombin
Synonyms:
Activation peptide fragment 1 Coagulation factor II Prothrombin precursor Thrombin heavy chain | Thrombin light chain
Type:
Protein
Mol. Mass.:
70029.57
Organism:
Homo sapiens (Human)
Description:
P00734
Residue:
622
  
Inhibitor
Name:
BDBM32881
Synonyms:
MLS000706208 [3-(2-furanyl)-5-(methylthio)-1,2,4-triazol-1-yl]-(2-methoxyphenyl)methanone [3-(furan-2-yl)-5-methylsulfanyl-1,2,4-triazol-1-yl]-(2-methoxyphenyl)methanone | cid_977140
Type:
Small organic molecule
Emp. Form.:
C15H13N3O3S
Mol. Mass.:
315.347
SMILES:
COc1ccccc1C(=O)n1nc(nc1SC)-c1ccco1
:
Substrate
Name:
Boc-Val-Pro-Arg-AMC
Synonyms:
Type:
fluorogenic substrate
Mol. Mass.:
358.43
Organism:
Description:
Residue:
3
NA