Target
Bcl-2-related protein A1
Ligand
BDBM34170
Substrate
FITC-Ahx-EDIIRNIARHLAQVGDSMDR
Meas. Tech.
HTS discovery of chemical inhibitors of anti-apoptotic protein Bfl-1
pH
7±n/a
Temperature
296.15±n/a K
IC50
14459±0 nM
Citation
 PubChem, PC HTS discovery of chemical inhibitors of anti-apoptotic protein Bfl-1 PubChem Bioassay (2008)[AID] 
Target
Name:
Bcl-2-related protein A1
Synonyms:
A1 B-cell leukemia/lymphoma 2 related protein A1a Bcl2a1 Bfl-1 Hemopoietic-specific early response protein | Protein BFL-1
Type:
Apoptosis regulator protein
Mol. Mass.:
19909.74
Organism:
Mus musculus (Mouse)
Description:
gi_11024684
Residue:
172
  
Inhibitor
Name:
BDBM34170
Synonyms:
2-[(2-ethyl-1-keto-7,8-dihydro-6H-cyclopenta[2,3]thieno[2,4-b]pyrimidin-3-yl)thio]acetic acid 2-[(2-ethyl-1-oxo-7,8-dihydro-6H-cyclopenta[2,3]thieno[2,4-b]pyrimidin-3-yl)sulfanyl]acetic acid MLS000069140 cid_658077
Type:
Small organic molecule
Emp. Form.:
C13H14N2O3S2
Mol. Mass.:
310.392
SMILES:
CCn1c(SCC(O)=O)nc2sc3CCCc3c2c1=O
:
Substrate
Name:
FITC-Ahx-EDIIRNIARHLAQVGDSMDR
Synonyms:
FITC-Bid peptide
Type:
fluorescein-labeled peptide
Mol. Mass.:
358.43
Organism:
Description:
Residue:
3
NA