Target
Bcl-2-related protein A1
Ligand
BDBM34173
Substrate
FITC-Ahx-EDIIRNIARHLAQVGDSMDR
Meas. Tech.
HTS discovery of chemical inhibitors of anti-apoptotic protein Bfl-1
pH
7±n/a
Temperature
296.15±n/a K
IC50
>100000±0 nM
Citation
 PubChem, PC HTS discovery of chemical inhibitors of anti-apoptotic protein Bfl-1 PubChem Bioassay (2008)[AID] 
Target
Name:
Bcl-2-related protein A1
Synonyms:
A1 B-cell leukemia/lymphoma 2 related protein A1a Bcl2a1 Bfl-1 Hemopoietic-specific early response protein | Protein BFL-1
Type:
Apoptosis regulator protein
Mol. Mass.:
19909.74
Organism:
Mus musculus (Mouse)
Description:
gi_11024684
Residue:
172
  
Inhibitor
Name:
BDBM34173
Synonyms:
2-(3-chlorophenyl)-3-(furan-2-carbonyl)-4-hydroxy-1-pyrimidin-2-yl-2H-pyrrol-5-one 2-(3-chlorophenyl)-3-[2-furanyl(oxo)methyl]-4-hydroxy-1-(2-pyrimidinyl)-2H-pyrrol-5-one MLS000037295 cid_660196
Type:
Small organic molecule
Emp. Form.:
C19H12ClN3O4
Mol. Mass.:
381.769
SMILES:
Clc1cccc(c1)C1C(C(=O)c2ccco2)C(=O)C(=O)N1c1ncccn1
:
Substrate
Name:
FITC-Ahx-EDIIRNIARHLAQVGDSMDR
Synonyms:
FITC-Bid peptide
Type:
fluorescein-labeled peptide
Mol. Mass.:
358.43
Organism:
Description:
Residue:
3
NA