Target
Bcl-2-related protein A1
Ligand
BDBM34188
Substrate
FITC-Ahx-EDIIRNIARHLAQVGDSMDR
Meas. Tech.
HTS discovery of chemical inhibitors of anti-apoptotic protein Bfl-1
pH
7±n/a
Temperature
296.15±n/a K
IC50
3780±0 nM
Citation
 PubChem, PC HTS discovery of chemical inhibitors of anti-apoptotic protein Bfl-1 PubChem Bioassay (2008)[AID] 
Target
Name:
Bcl-2-related protein A1
Synonyms:
A1 B-cell leukemia/lymphoma 2 related protein A1a Bcl2a1 Bfl-1 Hemopoietic-specific early response protein | Protein BFL-1
Type:
Apoptosis regulator protein
Mol. Mass.:
19909.74
Organism:
Mus musculus (Mouse)
Description:
gi_11024684
Residue:
172
  
Inhibitor
Name:
BDBM34188
Synonyms:
2-[4-(4-fluorophenyl)-6-(trifluoromethyl)pyrimidin-2-yl]sulfonylacetic acid ethyl ester MLS000100272 cid_2980973 ethyl 2-[4-(4-fluorophenyl)-6-(trifluoromethyl)pyrimidin-2-yl]sulfonylethanoate | ethyl {[4-(4-fluorophenyl)-6-(trifluoromethyl)-2-pyrimidinyl]sulfonyl}acetate
Type:
Small organic molecule
Emp. Form.:
C15H12F4N2O4S
Mol. Mass.:
392.325
SMILES:
CCOC(=O)CS(=O)(=O)c1nc(cc(n1)C(F)(F)F)-c1ccc(F)cc1
:
Substrate
Name:
FITC-Ahx-EDIIRNIARHLAQVGDSMDR
Synonyms:
FITC-Bid peptide
Type:
fluorescein-labeled peptide
Mol. Mass.:
358.43
Organism:
Description:
Residue:
3
NA