Target
Gag-Pol polyprotein
Ligand
BDBM34370
Substrate
RNA/DNA hybrid
Meas. Tech.
HIV-1 RT-RNase H MLSCN MH077605 Probe Assessment: Dose response Assay
pH
8±n/a
Temperature
296.15±n/a K
IC50
879.000008±n/a nM
Citation
 PubChem, PC HIV-1 RT-RNase H MLSCN MH077605 Probe Assessment: Dose response Assay PubChem Bioassay (2007)[AID] 
Target
Name:
Gag-Pol polyprotein
Synonyms:
HIV-1 reverse transcriptase (HIV-1 RT) POL_HV1H2 Protease Reverse transcriptase (RT) gag-pol p66 RT
Type:
Protein
Mol. Mass.:
162074.74
Organism:
Human immunodeficiency virus type 1 group M subtype B (isolate HXB2)
Description:
P04585
Residue:
1435
  
Inhibitor
Name:
BDBM34370
Synonyms:
4-[2-[2-(3,4-dihydroxyphenyl)-2-oxoethyl]sulfanyl-4-oxoquinazolin-3-yl]-N-(oxolan-2-ylmethyl)butanamide 4-[2-[[2-(3,4-dihydroxyphenyl)-2-keto-ethyl]thio]-4-keto-quinazolin-3-yl]-N-(tetrahydrofurfuryl)butyramide 4-[2-{[2-(3,4-dihydroxyphenyl)-2-oxoethyl]thio}-4-oxoquinazolin-3(4H)-yl]-N-(tetrahydrofuran-2-ylmethyl)butanamide SMR000030885 | cid_3239220
Type:
Small organic molecule
Emp. Form.:
C25H27N3O6S
Mol. Mass.:
497.563
SMILES:
Oc1ccc(cc1O)C(=O)CSc1nc2ccccc2c(=O)n1CCCC(=O)NCC1CCCO1
:
Substrate
Name:
RNA/DNA hybrid
Synonyms:
Type:
fluorescein-labeled RNA annealed to DNA
Mol. Mass.:
358.43
Organism:
Description:
It is a 18-nucleotide 3-fluorescein-labeled RNA annealed to a complementary 18-nucleotide 5-Dabcyl-modified DNA.
Residue:
3
NA