Target
Mannose-6-phosphate isomerase
Ligand
BDBM34951
Substrate
Mannose-6-phosphate
Meas. Tech.
HTS identification of compounds inhibiting phosphomannose isomerase (PMI) via a fluorescence intensity assay using a high concentration of mannose 6-phosphate
pH
7.4±n/a
Temperature
296.15±n/a K
IC50
11476±0 nM
Citation
 PubChem, PC HTS identification of compounds inhibiting phosphomannose isomerase (PMI) via a fluorescence intensity assay using a high concentration of mannose 6-phosphate PubChem Bioassay (2009)[AID] 
Target
Name:
Mannose-6-phosphate isomerase
Synonyms:
MPI MPI_HUMAN PMI1
Type:
PROTEIN
Mol. Mass.:
46651.35
Organism:
Homo sapiens (Human)
Description:
ChEMBL_1448919
Residue:
423
  
Inhibitor
Name:
BDBM34951
Synonyms:
(1,3,3-trimethyl-2-methylene-6-nitro-indolin-5-yl)amine 1,3,3-trimethyl-2-methylidene-6-nitro-indol-5-amine MLS001018628 cid_4677543
Type:
Small organic molecule
Emp. Form.:
C12H15N3O2
Mol. Mass.:
233.2664
SMILES:
CN1C(=C)C(C)(C)c2cc(N)c(cc12)[N+]([O-])=O
:
Substrate
Name:
Mannose-6-phosphate
Synonyms:
Type:
Mol. Mass.:
358.43
Organism:
Description:
Residue:
3
NA