Target
26S proteasome non-ATPase regulatory subunit 14
Ligand
BDBM401033
Substrate
Meas. Tech.
Biochemical Assay
IC50
200±n/a nM
Citation
 Deshaies, RJLi, JCohen, SPerez, CMa, Y Inhibitors of RPN11 US Patent  US10005735 Publication Date 6/26/2018 
Target
Name:
26S proteasome non-ATPase regulatory subunit 14
Synonyms:
26S Proteasome regulatory subunit Rpn11 (Rpn11) PSDE_HUMAN PSMD14 protein
Type:
Protein
Mol. Mass.:
34576.68
Organism:
Homo sapiens (Human)
Description:
O00487
Residue:
310
  
Inhibitor
Name:
BDBM401033
Synonyms:
US10005735, Compound 31
Type:
Small organic molecule
Emp. Form.:
C23H29N5O3S2
Mol. Mass.:
487.638
SMILES:
Sc1cccc2cc(cnc12)C(=O)NCCCNC(=O)CCCC[C@@H]1SC[C@@H]2NC(=O)N[C@H]12
: