Target
Leucyl-cystinyl aminopeptidase
Ligand
BDBM401320
Substrate
Meas. Tech.
Inhibition Assay
IC50
1.70±n/a nM
Citation
 Kawaguchi, KIshihata, AKanai, ATsuchiya, KInagaki, YKazami, JMorikawa, HHiramoto, MEnjo, KTakamatsu, H Pyridine derivatives US Patent  US10005762 Publication Date 6/26/2018 
Target
Name:
Leucyl-cystinyl aminopeptidase
Synonyms:
Cystinyl aminopeptidase Insulin-regulated membrane aminopeptidase Irap Leucyl-cystinyl aminopeptidase Otase P-LAP Vesicle protein of 165 kDa | Vp165
Type:
PROTEIN
Mol. Mass.:
117179.39
Organism:
Rattus norvegicus
Description:
ChEMBL_98523
Residue:
1025
  
Inhibitor
Name:
BDBM401320
Synonyms:
US10005762, Example 4(1)
Type:
Small organic molecule
Emp. Form.:
C20H32N2O3
Mol. Mass.:
348.4797
SMILES:
CC(C)C[C@H](N)[C@](O)(Cc1cc(CCCC2CC2)c(C)cn1)C(O)=O
: