Target
Dual specificity protein phosphatase 1
Ligand
BDBM35404
Substrate
OMFP Substrate
Meas. Tech.
In vitro MKP-1 Phosphatase HTS Dose Response Confirmation Assay
pH
7±n/a
Temperature
295.15±n/a K
IC50
>50000±n/a nM
Citation
 PubChem, PC In vitro MKP-1 Phosphatase HTS Dose Response Confirmation Assay PubChem Bioassay (2007)[AID] 
Target
Name:
Dual specificity protein phosphatase 1
Synonyms:
CL100 DUSP1 MAP kinase phosphatase 1 MKP1 Protein-tyrosine phosphatase CL100 | VH1
Type:
Protein phosphatase
Mol. Mass.:
39301.48
Organism:
Homo sapiens (Human)
Description:
gi_4758204
Residue:
367
  
Inhibitor
Name:
BDBM35404
Synonyms:
6-(4-methoxyphenyl)-3-methyl-N-(6-methyl-2-pyridinyl)-2-imidazo[2,1-b]thiazolecarboxamide 6-(4-methoxyphenyl)-3-methyl-N-(6-methylpyridin-2-yl)imidazo[2,1-b][1,3]thiazole-2-carboxamide SMR000016545 | cid_3242860
Type:
Small organic molecule
Emp. Form.:
C20H18N4O2S
Mol. Mass.:
378.448
SMILES:
COc1ccc(cc1)-c1cn2c(C)c(sc2n1)C(=O)Nc1cccc(C)n1
:
Substrate
Name:
OMFP Substrate
Synonyms:
3-O-methylfluorescein phosphate | OMFP
Type:
fluorescent substrate
Mol. Mass.:
358.43
Organism:
Description:
Residue:
3
NA