Target
Cathepsin B
Ligand
BDBM35495
Substrate
Z-Arg-Arg-AMC
Meas. Tech.
Cathepsin B mixture HTS dose-response confirmation
pH
6.8±n/a
Temperature
296.15±n/a K
IC50
>50000±n/a nM
Citation
 PubChem, PC Cathepsin B mixture HTS dose-response confirmation  PubChem Bioassay (2008)[AID] 
Target
Name:
Cathepsin B
Synonyms:
APP secretase CATB_HUMAN CTSB Cathepsin B light chain | Cathepsin B1
Type:
Enzyme
Mol. Mass.:
37819.69
Organism:
Homo sapiens (Human)
Description:
gi_63102437
Residue:
339
  
Inhibitor
Name:
BDBM35495
Synonyms:
4-(5-piperidin-1-yl-1,2,4-oxadiazol-3-yl)-1,2,5-oxadiazol-3-amine MLS000079108 [4-(5-piperidino-1,2,4-oxadiazol-3-yl)furazan-3-yl]amine | cid_658581
Type:
Small organic molecule
Emp. Form.:
C9H12N6O2
Mol. Mass.:
236.2306
SMILES:
Nc1nonc1-c1noc(n1)N1CCCCC1
:
Substrate
Name:
Z-Arg-Arg-AMC
Synonyms:
Benzyloxycarbonyl- L-arginyl- L-arginine- 4-methylcoumaryl-7-amide
Type:
fluorogenic substrate
Mol. Mass.:
358.43
Organism:
Description:
Residue:
3
NA