Target
Cathepsin B
Ligand
BDBM35501
Substrate
Z-Arg-Arg-AMC
Meas. Tech.
Cathepsin B mixture HTS dose-response confirmation
pH
6.8±n/a
Temperature
296.15±n/a K
IC50
>50000±n/a nM
Citation
 PubChem, PC Cathepsin B mixture HTS dose-response confirmation  PubChem Bioassay (2008)[AID] 
Target
Name:
Cathepsin B
Synonyms:
APP secretase CATB_HUMAN CTSB Cathepsin B light chain | Cathepsin B1
Type:
Enzyme
Mol. Mass.:
37819.69
Organism:
Homo sapiens (Human)
Description:
gi_63102437
Residue:
339
  
Inhibitor
Name:
BDBM35501
Synonyms:
4-[2,3-bis(2-furyl)quinoxalin-6-yl]sulfonylmorpholine 4-[[2,3-bis(2-furanyl)-6-quinoxalinyl]sulfonyl]morpholine SMR000066141 | cid_2338527
Type:
Small organic molecule
Emp. Form.:
C20H17N3O5S
Mol. Mass.:
411.431
SMILES:
O=S(=O)(N1CCOCC1)c1ccc2nc(-c3ccco3)c(nc2c1)-c1ccco1
:
Substrate
Name:
Z-Arg-Arg-AMC
Synonyms:
Benzyloxycarbonyl- L-arginyl- L-arginine- 4-methylcoumaryl-7-amide
Type:
fluorogenic substrate
Mol. Mass.:
358.43
Organism:
Description:
Residue:
3
NA