Target
Cathepsin B
Ligand
BDBM32783
Substrate
Z-Arg-Arg-AMC
Meas. Tech.
Cathepsin B mixture HTS dose-response confirmation
pH
6.8±n/a
Temperature
296.15±n/a K
IC50
434.637±n/a nM
Citation
 PubChem, PC Cathepsin B mixture HTS dose-response confirmation  PubChem Bioassay (2008)[AID] 
Target
Name:
Cathepsin B
Synonyms:
APP secretase CATB_HUMAN CTSB Cathepsin B light chain | Cathepsin B1
Type:
Enzyme
Mol. Mass.:
37819.69
Organism:
Homo sapiens (Human)
Description:
gi_63102437
Residue:
339
  
Inhibitor
Name:
BDBM32783
Synonyms:
2-thiophenecarboxylic acid [5-amino-1-(4-fluorophenyl)sulfonyl-3-pyrazolyl] ester CHEMBL390485 SMR000021568 [5-azanyl-1-(4-fluorophenyl)sulfonyl-pyrazol-3-yl] thiophene-2-carboxylate thiophene-2-carboxylic acid [5-amino-1-(4-fluorophenyl)sulfonyl-pyrazol-3-yl] ester
Type:
Small organic molecule
Emp. Form.:
C14H10FN3O4S2
Mol. Mass.:
367.375
SMILES:
Nc1cc(OC(=O)c2cccs2)nn1S(=O)(=O)c1ccc(F)cc1
:
Substrate
Name:
Z-Arg-Arg-AMC
Synonyms:
Benzyloxycarbonyl- L-arginyl- L-arginine- 4-methylcoumaryl-7-amide
Type:
fluorogenic substrate
Mol. Mass.:
358.43
Organism:
Description:
Residue:
3
NA