Target
Cathepsin B
Ligand
BDBM35518
Substrate
Z-Arg-Arg-AMC
Meas. Tech.
Cathepsin B mixture HTS dose-response confirmation
pH
6.8±n/a
Temperature
296.15±n/a K
IC50
46161.2±n/a nM
Citation
 PubChem, PC Cathepsin B mixture HTS dose-response confirmation  PubChem Bioassay (2008)[AID] 
Target
Name:
Cathepsin B
Synonyms:
APP secretase CATB_HUMAN CTSB Cathepsin B light chain | Cathepsin B1
Type:
Enzyme
Mol. Mass.:
37819.69
Organism:
Homo sapiens (Human)
Description:
gi_63102437
Residue:
339
  
Inhibitor
Name:
BDBM35518
Synonyms:
2-[2-(4-amino-1,2,5-oxadiazol-3-yl)-1-benzimidazolyl]-1-[4-(4-fluorophenyl)-1-piperazinyl]ethanone 2-[2-(4-aminofurazan-3-yl)benzimidazol-1-yl]-1-[4-(4-fluorophenyl)piperazino]ethanone 4-(1-{2-[4-(4-fluorophenyl)-1-piperazinyl]-2-oxoethyl}-1H-benzimidazol-2-yl)-1,2,5-oxadiazol-3-amine SMR000075046 | cid_1265644
Type:
Small organic molecule
Emp. Form.:
C21H20FN7O2
Mol. Mass.:
421.4276
SMILES:
Nc1nonc1-c1nc2ccccc2n1CC(=O)N1CCN(CC1)c1ccc(F)cc1
:
Substrate
Name:
Z-Arg-Arg-AMC
Synonyms:
Benzyloxycarbonyl- L-arginyl- L-arginine- 4-methylcoumaryl-7-amide
Type:
fluorogenic substrate
Mol. Mass.:
358.43
Organism:
Description:
Residue:
3
NA