Target
Beta-secretase 1
Ligand
BDBM50271167
Substrate
Meas. Tech.
BACE-1 Ki Assay (BACE-1 HTRF FRET Assay)
Ki
42.0±n/a nM
Citation
 Scott, JDBlizzard, TAWalsh, SPCumming, JN C5-C6-carbocyclic fused iminothiadiazine dioxides as BACE inhibitors, compositions, and their use US Patent  US10329291 Publication Date 6/25/2019 
Target
Name:
Beta-secretase 1
Synonyms:
ASP2 Aspartyl protease 2 BACE1 Beta-secretase (BACE) Beta-secretase 1 (BACE 1) Beta-secretase 1 (BACE1) Beta-site amyloid precursor protein cleaving enzyme 1 Memapsin-2 beta-Secretase (BACE-1) | beta-Secretase (BACE1)
Type:
Protein
Mol. Mass.:
55755.10
Organism:
Homo sapiens (Human)
Description:
P56817
Residue:
501
  
Inhibitor
Name:
BDBM50271167
Synonyms:
CHEMBL4127870
Type:
Small organic molecule
Emp. Form.:
C20H22FN5O3S
Mol. Mass.:
431.484
SMILES:
[H][C@@]12CCC[C@@]1(NC(=N)N(C)S2(=O)=O)c1cc(NC(=O)c2ccc(C)cn2)ccc1F
: