Target
Heat shock protein HSP 90-beta
Ligand
BDBM31044
Substrate
Meas. Tech.
Fluorescence Polarization Assay
pH
8±0
Kd
308±0.0 nM
Citation
 Yi, FRegan, L A novel class of small molecule inhibitors of Hsp90. ACS Chem Biol 3:645-54 (2008)  
Target
Name:
Heat shock protein HSP 90-beta
Synonyms:
HS90B_HUMAN HSP 90 HSP90B HSPCB Heat shock protein HSP 90 (Hsp90)
Type:
Molecular Chaperone
Mol. Mass.:
83229.45
Organism:
Homo sapiens (Human)
Description:
P08238
Residue:
724
  
Inhibitor
Name:
BDBM31044
Synonyms:
1-Ethyl-6-methyl-3-thiophen-2-yl-1H-pyrimido[5,4-e][1,2,4]triazine-5,7-dione 1-ethyl-6-methyl-3-thiophen-2-yl-pyrimido[5,4-e][1,2,4]triazine-5,7-dione MLS000033110 US9073941, 610 | cid_653297
Type:
Small organic molecule
Emp. Form.:
C12H11N5O2S
Mol. Mass.:
289.313
SMILES:
CCn1nc(nc2c1nc(=O)n(C)c2=O)-c1cccs1
: