Target
Dual specificity protein kinase TTK
Ligand
BDBM6866
Substrate
Meas. Tech.
Kinase Inhibitor Selectivity Profiling Assay
Kd
190±n/a nM
Citation
 PubChem, PC Kinase Inhibitor Selectivity Profiling Assay PubChem Bioassay (2008)[AID] 
Target
Name:
Dual specificity protein kinase TTK
Synonyms:
Dual specificity protein kinase (TTK) MPS1 Monopolar Spindle 1 (MPS1) Monopolar Spindle 1 Kinase (MPS1) TTK | TTK_HUMAN
Type:
Protein
Mol. Mass.:
97086.79
Organism:
Homo sapiens (Human)
Description:
P33981
Residue:
857
  
Inhibitor
Name:
BDBM6866
Synonyms:
1-Acyl-1H-[1,2,4]triazole-3,5-diamine Analogue 3b 4-[[5-Amino-1-(2,6-difluorobenzoyl)-1H-1,2,4-triazol-3-yl]amino]-benzenesulfonamide JNJ-7706621 | cid_5330790
Type:
Small organic molecule
Emp. Form.:
C15H12F2N6O3S
Mol. Mass.:
394.356
SMILES:
Nc1nc(Nc2ccc(cc2)S(N)(=O)=O)nn1C(=O)c1c(F)cccc1F
: