Target
Pantothenate synthetase
Ligand
BDBM37300
Substrate
Meas. Tech.
Mycobacterium tuberculosis Pantothenate Synthetase Assay
IC50
>100000±n/a nM
Comments
Extracted from aid = 375 and tid = 17
Citation
 PubChem, PC Mycobacterium tuberculosis Pantothenate Synthetase Assay PubChem Bioassay (2006)[AID] 
Target
Name:
Pantothenate synthetase
Synonyms:
Chain A, Crystal Structure Of A Pantothenate Synthetase, Apo Enzyme In C2 Space Group Pantothenate synthetase | panC
Type:
Mol. Mass.:
32675.10
Organism:
Mycobacterium tuberculosis (strain ATCC 25618 / H37Rv)
Description:
ChEMBL_102878
Residue:
309
  
Inhibitor
Name:
BDBM37300
Synonyms:
MLS000087231 N-[1-(4-chlorobenzyl)-5-methyl-pyrazol-3-yl]-5-(2-furyl)isoxazole-3-carboxamide N-[1-[(4-chlorophenyl)methyl]-5-methyl-pyrazol-3-yl]-5-(furan-2-yl)-1,2-oxazole-3-carboxamide SMR000023454 | cid_3242024
Type:
Small organic molecule
Emp. Form.:
C19H15ClN4O3
Mol. Mass.:
382.8
SMILES:
Cc1cc(NC(=O)c2cc(on2)-c2ccco2)nn1Cc1ccc(Cl)cc1
: