Target
Pantothenate synthetase
Ligand
BDBM37288
Substrate
Meas. Tech.
Mycobacterium tuberculosis Pantothenate Synthetase Assay
IC50
>100000±n/a nM
Comments
k3888r67848
Citation
 PubChem, PC Mycobacterium tuberculosis Pantothenate Synthetase Assay PubChem Bioassay (2006)[AID] 
Target
Name:
Pantothenate synthetase
Synonyms:
Chain A, Crystal Structure Of A Pantothenate Synthetase, Apo Enzyme In C2 Space Group Pantothenate synthetase | panC
Type:
Mol. Mass.:
32675.10
Organism:
Mycobacterium tuberculosis (strain ATCC 25618 / H37Rv)
Description:
ChEMBL_102878
Residue:
309
  
Inhibitor
Name:
BDBM37288
Synonyms:
5-(4-chlorophenyl)-N-[1-(4-methylbenzyl)-1H-pyrazol-3-yl]isoxazole-3-carboxamide 5-(4-chlorophenyl)-N-[1-[(4-methylphenyl)methyl]-3-pyrazolyl]-3-isoxazolecarboxamide MLS000087019 cid_3236497
Type:
Small organic molecule
Emp. Form.:
C21H17ClN4O2
Mol. Mass.:
392.838
SMILES:
Cc1ccc(Cn2ccc(NC(=O)c3cc(on3)-c3ccc(Cl)cc3)n2)cc1
: