Target
Sphingosine 1-phosphate receptor 3
Ligand
BDBM30781
Substrate
Meas. Tech.
S1P3 Agonist Dose-Response Potency Assay
EC50
6690±n/a nM
Citation
 PubChem, PC S1P3 Agonist Dose-Response Potency Assay PubChem Bioassay (2007)[AID] 
Target
Name:
Sphingosine 1-phosphate receptor 3
Synonyms:
C9orf108 EDG3 S1P receptor 3 S1P3 S1PR3_HUMAN Sphingosine 1-phosphate receptor 3 (S1P3) | Sphingosine 1-phosphate receptor Edg-3
Type:
G Protein-Coupled Receptor (GPCR)
Mol. Mass.:
42278.13
Organism:
Homo sapiens (Human)
Description:
Q99500
Residue:
378
  
Inhibitor
Name:
BDBM30781
Synonyms:
2-[[2-(3,5-dimethyl-1-pyrazolyl)-5,6,7,8-tetrahydro-[1]benzothiolo[2,3-d]pyrimidin-4-yl]amino]ethanol 2-[[2-(3,5-dimethylpyrazol-1-yl)-5,6,7,8-tetrahydrobenzothiopheno[2,3-d]pyrimidin-4-yl]amino]ethanol SMR000046729 | cid_665434
Type:
Small organic molecule
Emp. Form.:
C17H21N5OS
Mol. Mass.:
343.447
SMILES:
Cc1cc(C)n(n1)-c1nc(NCCO)c2c3CCCCc3sc2n1
: