Target
Sphingosine 1-phosphate receptor 3
Ligand
BDBM30786
Substrate
Meas. Tech.
S1P3 Agonist Dose-Response Potency Assay
EC50
63900±n/a nM
Citation
 PubChem, PC S1P3 Agonist Dose-Response Potency Assay PubChem Bioassay (2007)[AID] 
Target
Name:
Sphingosine 1-phosphate receptor 3
Synonyms:
C9orf108 EDG3 S1P receptor 3 S1P3 S1PR3_HUMAN Sphingosine 1-phosphate receptor 3 (S1P3) | Sphingosine 1-phosphate receptor Edg-3
Type:
G Protein-Coupled Receptor (GPCR)
Mol. Mass.:
42278.13
Organism:
Homo sapiens (Human)
Description:
Q99500
Residue:
378
  
Inhibitor
Name:
BDBM30786
Synonyms:
1-(4-chlorobenzyl)-N-(2-furfuryl)-2-imino-5-keto-dipyrido[1,2-d:3',4'-f]pyrimidine-3-carboxamide 1-[(4-chlorophenyl)methyl]-N-(furan-2-ylmethyl)-2-imino-5-oxodipyrido[1,2-d:3',4'-f]pyrimidine-3-carboxamide MLS000083283 cid_666486
Type:
Small organic molecule
Emp. Form.:
C24H18ClN5O3
Mol. Mass.:
459.884
SMILES:
Clc1ccc(Cn2c3nc4ccccn4c(=O)c3cc(C(=O)NCc3ccco3)c2=N)cc1
: