Target
Sphingosine 1-phosphate receptor 3
Ligand
BDBM37324
Substrate
Meas. Tech.
S1P3 Agonist Dose-Response Potency Assay
EC50
41700±n/a nM
Citation
 PubChem, PC S1P3 Agonist Dose-Response Potency Assay PubChem Bioassay (2007)[AID] 
Target
Name:
Sphingosine 1-phosphate receptor 3
Synonyms:
C9orf108 EDG3 S1P receptor 3 S1P3 S1PR3_HUMAN Sphingosine 1-phosphate receptor 3 (S1P3) | Sphingosine 1-phosphate receptor Edg-3
Type:
G Protein-Coupled Receptor (GPCR)
Mol. Mass.:
42278.13
Organism:
Homo sapiens (Human)
Description:
Q99500
Residue:
378
  
Inhibitor
Name:
BDBM37324
Synonyms:
2,5-diphenyl-N-(2-thiazolin-2-yl)pyrazole-3-carboxamide N-(4,5-dihydro-1,3-thiazol-2-yl)-2,5-diphenyl-pyrazole-3-carboxamide N-(4,5-dihydrothiazol-2-yl)-2,5-diphenyl-3-pyrazolecarboxamide cid_2114594
Type:
Small organic molecule
Emp. Form.:
C19H16N4OS
Mol. Mass.:
348.422
SMILES:
O=C(NC1=NCCS1)c1cc(nn1-c1ccccc1)-c1ccccc1
: