Target
Sphingosine 1-phosphate receptor 3
Ligand
BDBM30891
Substrate
Meas. Tech.
S1P3 Agonist Dose-Response Potency Assay
EC50
17700±n/a nM
Citation
 PubChem, PC S1P3 Agonist Dose-Response Potency Assay PubChem Bioassay (2007)[AID] 
Target
Name:
Sphingosine 1-phosphate receptor 3
Synonyms:
C9orf108 EDG3 S1P receptor 3 S1P3 S1PR3_HUMAN Sphingosine 1-phosphate receptor 3 (S1P3) | Sphingosine 1-phosphate receptor Edg-3
Type:
G Protein-Coupled Receptor (GPCR)
Mol. Mass.:
42278.13
Organism:
Homo sapiens (Human)
Description:
Q99500
Residue:
378
  
Inhibitor
Name:
BDBM30891
Synonyms:
MLS000049147 N-(2-furfuryl)-7-hydroxy-2-keto-chromene-3-carboxamide N-(furan-2-ylmethyl)-7-hydroxy-2-oxochromene-3-carboxamide SMR000074483 | cid_5398663
Type:
Small organic molecule
Emp. Form.:
C15H11NO5
Mol. Mass.:
285.2515
SMILES:
Oc1ccc2cc(C(=O)NCc3ccco3)c(=O)oc2c1
: